Reaction Details
TargetLysine-specific demethylase 3A
LigandBDBM223320
Substrate/Competitorn/a
Meas. Tech.AlphaScreen Assay
IC50 3e+4±3.0e+4 nM
Citation Tumber, ANuzzi, AHookway, ESHatch, SBVelupillai, SJohansson, CKawamura, ASavitsky, PYapp, CSzykowska, AWu, NBountra, CStrain-Damerell, CBurgess-Brown, NARuda, GFFedorov, OMunro, SEngland, KSNowak, RPSchofield, CJLa Thangue, NBPawlyn, CDavies, FMorgan, GAthanasou, NMüller, SOppermann, UBrennan, PE Potent and Selective KDM5 Inhibitor Stops Cellular Demethylation of H3K4me3 at Transcription Start Sites and Proliferation of MM1S Myeloma Cells. Cell Chem Biol24:371-380 (2017) 
 
Lysine-specific demethylase 3A
Name:Lysine-specific demethylase 3A
Type:PROTEIN
Mol. Mass.:147368.22
Organism:Homo sapiens (Human)
Description:Q9Y4C1
Residue:1321
BDBM223320
NameBDBM223320
Synonyms:KDOAM-25
TypeSmall organic molecule
Emp. Form.C15H25N5O2
Mol. Mass.307.3913
SMILESCCN(CCN(C)C)C(=O)CNCc1cc(ccn1)C(N)=O