Reaction Details
TargetPolycomb protein EED
LigandBDBM223986
Substrate/Competitorn/a
Meas. Tech.TR-FRET Binding Assay
pH7.5±0
Temperature298.15±0 K
Ki 1±0.0 nM
Citation He, YSelvaraju, SCurtin, MLJakob, CGZhu, HComess, KMShaw, BThe, JLima-Fernandes, ESzewczyk, MMCheng, DKlinge, KLLi, HQPliushchev, MAlgire, MAMaag, DGuo, JDietrich, JPanchal, SCPetros, AMSweis, RFTorrent, MBigelow, LJSenisterra, GLi, FKennedy, SWu, QOsterling, DJLindley, DJGao, WGalasinski, SBarsyte-Lovejoy, DVedadi, MBuchanan, FGArrowsmith, CHChiang, GGSun, CPappano, WN The EED protein-protein interaction inhibitor A-395 inactivates the PRC2 complex. Nat Chem Biol13:389-395 (2017) 
 
Polycomb protein EED
Name:Polycomb protein EED
Type:Protein
Mol. Mass.:50201.68
Organism:Homo sapiens (Human)
Description:O75530
Residue:441
BDBM223986
NameBDBM223986
Synonyms:(3R,4S)-1-[(1S)-7-fluoroindan-1-yl]-N,N-dimethyl-4-(1-methylindol-3-yl)pyrrolidin-3-amine (3)
TypeSmall organic molecule
Emp. Form.C24H28FN3
Mol. Mass.377.4976
SMILESCN(C)[C@H]1CN(C[C@@H]1c1cn(C)c2ccccc12)[C@H]1CCc2cccc(F)c12