Reaction Details
TargetSerine/threonine-protein kinase haspin [470-798]
LigandBDBM224008
Substrate/Competitorn/a
Meas. Tech.Equilibrium Binding/Displacement Assay with Fluorescence Anisotropy
pH7.5±n/a
Kd 0.14±0.05 nM
Commentsextracted
Citation Kestav, KViht, KKonovalov, AEnkvist, EUri, ALavogina, D Slowly on, Slowly off: Bisubstrate-Analogue Conjugates of 5-Iodotubercidin and Histone H3 Peptide Targeting Protein Kinase Haspin. Chembiochem18:790-798 (2017) 
 
Serine/threonine-protein kinase haspin [470-798]
Name:Serine/threonine-protein kinase haspin [470-798]
Type:Enzyme
Mol. Mass.:37470.17
Organism:Homo sapiens (Human)
Description:Human haspin (470-798 aa)
Residue:329
BDBM224008
NameBDBM224008
Synonyms:ARC-3429
TypeSmall organic molecule
Emp. Form.C60H104IN24O18
Mol. Mass.1576.5206
SMILESCC(O)[C@H](NC(=O)[C@H](CCC(N)=O)NC(=O)[C@H](CCCNC(N)=[NH2+])NC(=O)[C@H](CCCCNC(=O)C[C@@H](NC(=O)CCCCCNC(=O)[C@H]1O[C@H]([C@H](O)[C@@H]1O)n1cc(I)c2c(N)ncnc12)C([O-])=O)NC(=O)[C@H](CCCNC(N)=[NH2+])NC(=O)[C@H](C)[NH3+])C(=O)N[C@@H](C)C(=O)N[C@H](CCCC[NH3+])C(N)=O