Reaction Details
TargetTransient receptor potential cation channel subfamily A member 1
LigandBDBM291170
Substrate/Competitorn/a
Meas. Tech.Fluorescence Assay
Temperature298.15±n/a K
IC50 13.0±n/a nM
Commentsextracted
Citation Brotherton-Pleiss, CEChen, HChen, SChen, ZErickson, SDEstrada, AKim, KLi, HLovey, AJLyssikatos, JPQian, YSo, SWovkulich, PMYi, L Substituted sulfonamide compounds US Patent US9580411 Publication Date 2/28/2017
 
Transient receptor potential cation channel subfamily A member 1
Name:Transient receptor potential cation channel subfamily A member 1
Type:Protein
Mol. Mass.:127514.20
Organism:Homo sapiens (Human)
Description:O75762
Residue:1119
BDBM291170
NameBDBM291170
Synonyms:2-[N-(Propan-2-yl)(4-fluorobenzene)sulfonamido]-N-([6-[4-(trifluoromethyl)cyclohex-1-en-1-yl]pyrimidin-4-yl]methyl)acetamide | US9580411, Example 85
TypeSmall organic molecule
Emp. Form.C23H26F4N4O3S
Mol. Mass.514.536
SMILESCC(C)N(CC(=O)NCc1cc(ncn1)C1=CCC(CC1)C(F)(F)F)S(=O)(=O)c1ccc(F)cc1