Reaction Details
TargetC-C chemokine receptor type 6
LigandBDBM291172
Substrate/Competitorn/a
Meas. Tech.In Vitro Affinity Assay
IC50 2.20±n/a nM
Citation Musicki, BAubert, JBoiteau, JClary, LRossio, PSchuppli-Nollet, M Disubstituted 3,4-diamino-3-cyclobutene-1,2-dione compounds for use in the treatment of chemokine-mediated diseases US Patent US9580412 Publication Date 2/28/2017
 
C-C chemokine receptor type 6
Name:C-C chemokine receptor type 6
Type:Enzyme
Mol. Mass.:42510.84
Organism:Homo sapiens (Human)
Description:P51684
Residue:374
BDBM291172
NameBDBM291172
Synonyms:2-hydroxy-N,N-dimethyl-3-(2-{[(5-methylfuran-2-yl)-(2-methyltetrahydrofuran-2-yl)methyl]amino}-3,4-dioxocyclobut-1-enylamino)benzamide | US9580412, Example 1
TypeSmall organic molecule
Emp. Form.C23H27N3O6
Mol. Mass.441.477
SMILESCNC(=O)c1cccc(NC2C(NC(c3ccc(C)o3)C3(C)CCCO3)C(=O)C2=O)c1O