Reaction Details
TargetC-C chemokine receptor type 6
LigandBDBM236789
Substrate/Competitorn/a
Meas. Tech.In Vitro Affinity Assay
IC50 8.80±n/a nM
Citation Musicki, BAubert, JBoiteau, JClary, LRossio, PSchuppli-Nollet, M Disubstituted 3,4-diamino-3-cyclobutene-1,2-dione compounds for use in the treatment of chemokine-mediated diseases US Patent US9580412 Publication Date 2/28/2017
 
C-C chemokine receptor type 6
Name:C-C chemokine receptor type 6
Type:Enzyme
Mol. Mass.:42510.84
Organism:Homo sapiens (Human)
Description:P51684
Residue:374
BDBM236789
NameBDBM236789
Synonyms:US9388149, 20 | US9580412, Example 20
TypeSmall organic molecule
Emp. Form.C27H29N3O7S
Mol. Mass.539.6
SMILESCOC(=O)[C@H]1CCCN1C(=O)c1cccc(Nc2c(NC(C3CCCS3)c3ccc(C)o3)c(=O)c2=O)c1O