Reaction Details
TargetIsocitrate dehydrogenase [NADP] cytoplasmic [R132H]
LigandBDBM228659
Substrate/Competitorn/a
Meas. Tech.IDH1 Biochemical Assay
IC50 68±1.2 nM
Citation Davis, MIGross, SShen, MStraley, KSPragani, RLea, WAPopovici-Muller, JDeLaBarre, BArtin, EThorne, NAuld, DSLi, ZDang, LBoxer, MBSimeonov, A Biochemical, cellular, and biophysical characterization of a potent inhibitor of mutant isocitrate dehydrogenase IDH1. J Biol Chem289:13717-25 (2014) 
 
Isocitrate dehydrogenase [NADP] cytoplasmic [R132H]
Name:Isocitrate dehydrogenase [NADP] cytoplasmic [R132H]
Type:Protein
Mol. Mass.:46641.74
Organism:Homo sapiens (Human)
Description:Human IDH1 R132H (SEQ ID No. 2 in patent). First three are removed. Google patent parsed wrong.
Residue:414
BDBM228659
NameBDBM228659
Synonyms:(+)-2-(2-(1H-Benzo[d]imidazol-1-yl)-N-(3-fluorophenyl)acetamido)-N-cyclopentyl-2-o-tolylacetamide | (+)-ML309
TypeSmall organic molecule
Emp. Form.C29H29FN4O2
Mol. Mass.484.5646
SMILESCc1ccccc1[C@@H](N(C(=O)Cn1cnc2ccccc12)c1cccc(F)c1)C(=O)NC1CCCC1