Reaction Details
TargetC-X-C chemokine receptor type 1
LigandBDBM236806
Substrate/Competitorn/a
Meas. Tech.In Vitro Affinity Assay
Temperature310.15±n/a K
IC50 108±n/a nM
Commentsextracted
Citation Musicki, BAubert, JBoiteaux, JClary, LRossio, PSchuppli-Nollet, M Disubstituted 3,4-diamino-3-cyclobutene-1,2-dione compounds for use in the treatment of chemokine-mediated diseases US Patent US9388149 Publication Date 7/12/2016
 
C-X-C chemokine receptor type 1
Name:C-X-C chemokine receptor type 1
Type:Enzyme
Mol. Mass.:39803.83
Organism:Homo sapiens (Human)
Description:P25024
Residue:350
BDBM236806
NameBDBM236806
Synonyms:US9388149, 6 | US9388149, 7 (Diastereoisomer 1)
TypeSmall organic molecule
Emp. Form.C27H29N3O7S
Mol. Mass.539.6
SMILESCOC(=O)[C@H]1CCCN1C(=O)c1cccc(Nc2c(NC(C3CCCS3)c3ccc(C)o3)c(=O)c2=O)c1O