Reaction Details
TargetC-X-C chemokine receptor type 1
LigandBDBM236791
Substrate/Competitorn/a
Meas. Tech.In Vitro Affinity Assay
Temperature310.15±n/a K
IC50 30±n/a nM
Commentsextracted
Citation Musicki, BAubert, JBoiteaux, JClary, LRossio, PSchuppli-Nollet, M Disubstituted 3,4-diamino-3-cyclobutene-1,2-dione compounds for use in the treatment of chemokine-mediated diseases US Patent US9388149 Publication Date 7/12/2016
 
C-X-C chemokine receptor type 1
Name:C-X-C chemokine receptor type 1
Type:Enzyme
Mol. Mass.:39803.83
Organism:Homo sapiens (Human)
Description:P25024
Residue:350
BDBM236791
NameBDBM236791
Synonyms:US9388149, 22 | US9580412, Example 22
TypeSmall organic molecule
Emp. Form.C25H29ClN4O6S2
Mol. Mass.581.104
SMILESCN1CCN(CC1)S(=O)(=O)c1c(Cl)ccc(Nc2c(NC(C3CCCS3)c3ccc(C)o3)c(=O)c2=O)c1O