Reaction Details
TargetEgl nine homolog 1
LigandBDBM242564
Substrate/Competitorn/a
Meas. Tech.Fluorescence Polarization Assay
pH7.5±n/a
IC50 26±n/a nM
Commentsextracted
Citation Takayama, TShibata, TShiozawa, FKawabe, KShimizu, YHamada, MHiratate, ATakahashi, MUshiyama, FOi, TShirasaki, YMatsuda, DKoizumi, CKato, S Partially saturated nitrogen-containing heterocyclic compound US Patent US9422240 Publication Date 8/23/2016
 
Egl nine homolog 1
Name:Egl nine homolog 1
Type:Protein
Mol. Mass.:46035.59
Organism:Homo sapiens (Human)
Description:Q9GZT9
Residue:426
BDBM242564
NameBDBM242564
Synonyms:US9422240, 1-367
TypeSmall organic molecule
Emp. Form.C21H20FN3O6
Mol. Mass.429.3984
SMILESCc1ccc(Oc2ccc(CN3CCC(O)=C(C(=O)NCC(O)=O)C3=O)cn2)cc1F