Reaction Details
TargetBeta-secretase 1 [1-454]
LigandBDBM150700
Substrate/Competitorn/a
Meas. Tech.Fluorescence Quench Assay
pH4.4±n/a
IC50 2±n/a nM
Commentsextracted
Citation Bukhtiyarov, YCacatian, SDillard, LWDorner-Ciossek, CFuchs, KJia, LLala, DSMorales-Ramos, AReeves, JSingh, SBVenkatraman, SXu, ZYuan, JZhao, YZheng, YRast, G Inhibitors of beta-secretase US Patent US9526727 Publication Date 12/27/2016
 
Beta-secretase 1 [1-454]
Name:Beta-secretase 1 [1-454]
Type:Protein
Mol. Mass.:50294.92
Organism:Homo sapiens (Human)
Description:Human BACE1 truncation (1-454 aa)
Residue:454
BDBM150700
NameBDBM150700
Synonyms:US8981112, 7 US9949975, Example 7
TypeSmall organic molecule
Emp. Form.C22H28N4O3
Mol. Mass.396.4827
SMILESCOCCN1C(N)=N[C@@]2(C1=O)c1cc(ccc1C[C@@]21CC[C@H](OC)[C@@H](C)C1)C#N