Reaction Details
TargetEpithelial discoidin domain-containing receptor 1
LigandBDBM372044
Substrate/Competitorn/a
Meas. Tech.In Vitro Binding Assay for DDR1
IC50 27.3±n/a nM
Citation Buettelmann, BKocer, BKuhn, BPrunotto, MRichter, HRitter, MRudolph, MSatz, AL Triaza-spirodecanones as DDR1 inhibitors US Patent US10435407 Publication Date 10/8/2019
 
Epithelial discoidin domain-containing receptor 1
Name:Epithelial discoidin domain-containing receptor 1
Type:Tyrosine-protein kinase
Mol. Mass.:101130.02
Organism:Homo sapiens (Human)
Description:Q08345
Residue:913
BDBM372044
NameBDBM372044
Synonyms:(RS)-3-[2-(3-Fluoro-3-methylpyrrolidin-1-yl)-2-oxoethyl]-1-phenyl-8-(1H-pyrazolo[3,4-b]pyridine-5-carbonyl)-1,3,8-triazaspiro[4.5]decan-4-one US10435407, Example 67
TypeSmall organic molecule
Emp. Form.C27H30FN7O3
Mol. Mass.519.5706
SMILESCC1(F)CCN(C1)C(=O)CN1CN(c2ccccc2)C2(CCN(CC2)C(=O)c2cnc3[nH]ncc3c2)C1=O