Reaction Details
TargetEpithelial discoidin domain-containing receptor 1
LigandBDBM372078
Substrate/Competitorn/a
Meas. Tech.In Vitro Binding Assay for DDR1
IC50 18.7±n/a nM
Citation Buettelmann, BKocer, BKuhn, BPrunotto, MRichter, HRitter, MRudolph, MSatz, AL Triaza-spirodecanones as DDR1 inhibitors US Patent US10435407 Publication Date 10/8/2019
 
Epithelial discoidin domain-containing receptor 1
Name:Epithelial discoidin domain-containing receptor 1
Type:Tyrosine-protein kinase
Mol. Mass.:101130.02
Organism:Homo sapiens (Human)
Description:Q08345
Residue:913
BDBM372078
NameBDBM372078
Synonyms:2-(8-(1H-Indazole-5-carbonyl)-4-oxo-1-phenyl-1,3,8-triazaspiro[4.5]decan-3-yl)-N-methyl-N-(2,2,2-trifluoroethyl)acetamide US10435407, Example 101
TypeSmall organic molecule
Emp. Form.C26H27F3N6O3
Mol. Mass.528.5262
SMILESCN(CC(F)(F)F)C(=O)CN1CN(c2ccccc2)C2(CCN(CC2)C(=O)c2ccc3[nH]ncc3c2)C1=O