Reaction Details
TargetEpidermal growth factor receptor
LigandBDBM270572
Substrate/Competitorn/a
Meas. Tech.High Throughput EGFR Biochemical Assay
IC50 43.0±n/a nM
Citation Balan, GChou, CKim, MKirschberg, TALink, JOPhillips, GSaito, RDSquires, NHTaylor, JGWatkins, WJWright, NE Cot modulators and methods of use thereof US Patent US10577352 Publication Date 3/3/2020
 
Epidermal growth factor receptor
Name:Epidermal growth factor receptor
Type:Receptor Kinase Domain
Mol. Mass.:134279.59
Organism:Homo sapiens (Human)
Description:P00533
Residue:1210
BDBM270572
NameBDBM270572
Synonyms:N6-((S)-(1- cyclopropyl-1H- 1,2,3-triazol-4-yl)(4- fluorophenyl)methyl- d)-N4-((R)-1- phenylpropyl) quinazoline- 4,6-diamine US10577352, Compound I-4
TypeSmall organic molecule
Emp. Form.C29H28FN7
Mol. Mass.493.5779
SMILESCC[C@@H](Nc1ncnc2ccc(NC(c3cn(nn3)C3CC3)c3ccc(F)cc3)cc12)c1ccccc1