Reaction Details
TargetTissue-type plasminogen activator
LigandBDBM297798
Substrate/Competitorn/a
Meas. Tech.Plasma-based Clot Lysis Assay
IC50 14.0±n/a nM
Citation Ellermann, MValot, GCancho Grande, YHaßfeld, JKinzel, TKöbberling, JBeyer, KRöhrig, SSperzel, MStampfuß, JMeyer, IKöllnberger, MBurkhardt, NSchlemmer, KStegmann, CSchuhmacher, JWerner, MHeiermann, JHengeveld, WJ Piperidinylpyrazolopyrimidinones and their use US Patent US10118930 Publication Date 11/6/2018
 
Tissue-type plasminogen activator
Name:Tissue-type plasminogen activator
Type:Enzyme
Mol. Mass.:62931.08
Organism:Homo sapiens (Human)
Description:n/a
Residue:562
BDBM297798
NameBDBM297798
Synonyms:3-(Morpholin-4-ylcarbonyl)-7-(piperidin-4-yl)pyrazolo[1,5-a]pyrimidin-5(4H)-one hydrochloride | US10118930, Example 23
TypeSmall organic molecule
Emp. Form.C16H21N5O3
Mol. Mass.331.3696
SMILESO=C(N1CCOCC1)c1cnn2c(cc(=O)[nH]c12)C1CCNCC1