Reaction Details
TargetTissue-type plasminogen activator
LigandBDBM297850
Substrate/Competitorn/a
Meas. Tech.Plasma-based Clot Lysis Assay
IC50 12.0±n/a nM
Citation Ellermann, MValot, GCancho Grande, YHaßfeld, JKinzel, TKöbberling, JBeyer, KRöhrig, SSperzel, MStampfuß, JMeyer, IKöllnberger, MBurkhardt, NSchlemmer, KStegmann, CSchuhmacher, JWerner, MHeiermann, JHengeveld, WJ Piperidinylpyrazolopyrimidinones and their use US Patent US10118930 Publication Date 11/6/2018
 
Tissue-type plasminogen activator
Name:Tissue-type plasminogen activator
Type:Enzyme
Mol. Mass.:62931.08
Organism:Homo sapiens (Human)
Description:n/a
Residue:562
BDBM297850
NameBDBM297850
Synonyms:3-(Phenylsulfonyl)-7-(piperidin-4-yl)pyrazolo[1,5-a]pyrimidin-5(4H)-one hydrochloride | US10118930, Example 73
TypeSmall organic molecule
Emp. Form.C17H18N4O3S
Mol. Mass.358.415
SMILESO=c1cc(C2CCNCC2)n2ncc(c2[nH]1)S(=O)(=O)c1ccccc1