Reaction Details
TargetTissue-type plasminogen activator
LigandBDBM298037
Substrate/Competitorn/a
Meas. Tech.Plasma-based Clot Lysis Assay
IC50 12.0±n/a nM
Citation Ellermann, MValot, GCancho Grande, YHaßfeld, JKinzel, TKöbberling, JBeyer, KRöhrig, SSperzel, MStampfuß, JMeyer, IKöllnberger, MBurkhardt, NSchlemmer, KStegmann, CSchuhmacher, JWerner, MHeiermann, JHengeveld, WJ Piperidinylpyrazolopyrimidinones and their use US Patent US10118930 Publication Date 11/6/2018
 
Tissue-type plasminogen activator
Name:Tissue-type plasminogen activator
Type:Enzyme
Mol. Mass.:62931.08
Organism:Homo sapiens (Human)
Description:n/a
Residue:562
BDBM298037
NameBDBM298037
Synonyms:3-{5-[4-methyl-2-(trifluoromethyl)phenyl]-1,2,4-oxadiazol-3-yl}-7-(piperidin-4-yl)pyrazolo[1,5-c]pyrimidin-5(4H)-one hydrochloride | US10118930, Example 249
TypeSmall organic molecule
Emp. Form.C21H19F3N6O2
Mol. Mass.444.4098
SMILESCc1ccc(-c2nc(no2)-c2cnn3c(cc(=O)[nH]c23)C2CCNCC2)c(c1)C(F)(F)F