Reaction Details
TargetATR-interacting protein/Serine/threonine-protein kinase ATR
LigandBDBM268059
Substrate/Competitorn/a
Meas. Tech.Binding Assay ATR (tracer A)
IC50 10.00±n/a nM
Citation Wortmann, LLücking, ULefranc, JBriem, HKoppitz, MEis, KVon Nussbaum, FBader, BWengner, AMSiemeister, GBone, WLienau, PGrudzinska-Goebel, JMoosmayer, DEberspächer, USchick, H 2-(morpholin-4-yl)-1,7-naphthyridines US Patent US10772893 Publication Date 9/15/2020
 
ATR-interacting protein/Serine/threonine-protein kinase ATR
Name:ATR-interacting protein/Serine/threonine-protein kinase ATR
Synonyms:ATR/ATRIP
Type:Enzyme
Mol. Mass.:n/a
Description:n/a
Components:This complex has 2 components.
Component 1
Name:Serine/threonine-protein kinase ATR
Type:Protein
Mol. Mass.:301404.58
Organism:Homo sapiens (Human)
Description:Q13535
Residue:2644
Component 2
Name:ATR-interacting protein
Synonyms:AGS1 ATR-interacting protein (ATRIP) ATRIP_HUMAN
Type:Enzyme Catalytic Domain
Mol. Mass.:85833.30
Organism:Homo sapiens (Human)
Description:Q8WXE1
Residue:791
BDBM268059
NameBDBM268059
Synonyms:2-[(3R)-3-methylmorpholin-4-yl]-4-(1-methyl-1H-pyrrol-2-yl)-8-(1H-pyrazol-5-yl)-1,7-naphthyridine US11529356, Example 91 | US9549932, 91
TypeSmall organic molecule
Emp. Form.C21H22N6O
Mol. Mass.374.439
SMILESC[C@@H]1COCCN1c1cc(-c2cccn2C)c2ccnc(-c3ccn[nH]3)c2n1