Reaction Details
TargetProtein Wnt-3a
LigandBDBM300604
Substrate/Competitorn/a
Meas. Tech.HCT116 FOPFlash
IC50>50000±n/a nM
Comments0.000 12/22/2021
Citation Thede, KScott, WBender, EGolz, SHägebarth, ALienau, PPuehler, FBasting, DSchneider, DMöwes, MRichter, AZorn, LLiu, NMönning, USiegel, F Compounds US Patent US10130633 Publication Date 11/20/2018
 
Protein Wnt-3a
Name:Protein Wnt-3a
Type:PROTEIN
Mol. Mass.:39379.02
Organism:Homo sapiens (Human)
Description:ChEMBL_1469237
Residue:352
BDBM300604
NameBDBM300604
Synonyms:4-cyano-3-{[(4-methylpiperazin-1-yl)acetyl]amino}-N-(5-phenyl-1,3,4-thiadiazol-2-yl)benzamide | US10130633, Example 174
TypeSmall organic molecule
Emp. Form.C23H23N7O2S
Mol. Mass.461.539
SMILESCN1CCN(CC(=O)Nc2cc(ccc2C#N)C(=O)Nc2nnc(s2)-c2ccccc2)CC1