Reaction Details
TargetDiacylglycerol O-acyltransferase 2
LigandBDBM276762
Substrate/Competitorn/a
Meas. Tech.In Vitro Assay
IC50 83.0±n/a nM
Citation Boehm, MCabral, SDowling, MSFutatsugi, KHuard, KLee, ECLondregan, ATPolivkova, JPrice, DALi, Q Diacylglycerol acyl transferase 2 inhibitors US Patent US11034678 Publication Date 6/15/2021
 
Diacylglycerol O-acyltransferase 2
Name:Diacylglycerol O-acyltransferase 2
Type:Multi-pass membrane protein
Mol. Mass.:43848.90
Organism:Homo sapiens (Human)
Description:Q96PD7
Residue:388
BDBM276762
NameBDBM276762
Synonyms:US10071992, Example 7 | US11034678, Example 7
TypeSmall organic molecule
Emp. Form.C20H22N6O4
Mol. Mass.410.4265
SMILESCCOc1cccnc1Oc1cncc(c1)-c1ncc(nn1)C(=O)NC(C)(C)CO