BDBM47546 2-[[(E)-1-oxo-3-thiophen-2-ylprop-2-enyl]amino]-4-phenyl-3-thiophenecarboxylic acid::4-phenyl-2-[[(E)-3-(2-thienyl)acryloyl]amino]-3-thenoic acid::4-phenyl-2-[[(E)-3-thiophen-2-ylprop-2-enoyl]amino]thiophene-3-carboxylic acid::MLS000773385::SMR000364116::cid_1177253
SMILES: OC(=O)c1c(NC(=O)\C=C\c2cccs2)scc1-c1ccccc1
InChI Key: InChIKey=BTURFDFZCYITAI-CMDGGOBGSA-N
Data: 6 IC50  1 EC50
Activity Spreadsheet -- Enzyme Inhibition Constant Data from BindingDB
Found 7 hits for monomerid = 47546
Trg + Lig
Ki
nM
ΔG°
kcal/mole
IC50
nM
Kd
nM
EC50/IC50
nM
koff
s-1
kon
M-1s-1
pHTemp
°C
eukaryotic translation initiation factor 4 gamma, 1 isoform 4
(Homo sapiens (Human))
BDBM47546
(2-[[(E)-1-oxo-3-thiophen-2-ylprop-2-enyl]amino]-4-...)
Show SMILES OC(=O)c1c(NC(=O)\C=C\c2cccs2)scc1-c1ccccc1
Show InChI InChI=1S/C18H13NO3S2/c20-15(9-8-13-7-4-10-23-13)19-17-16(18(21)22)14(11-24-17)12-5-2-1-3-6-12/h1-11H,(H,19,20)(H,21,22)/b9-8+
Reactome pathway
PCBioAssay
n/an/a 5.76E+3n/an/an/an/an/an/a
Emory University Molecular Libraries Screening Center
Curated by PubChem BioAssay
Assay Description
Dose Response Confirmation for Small Molecule Inhibitors of Eukaryotic Translation Initiation NIH Molecular Libraries Screening Centers Network [MLSC...
PubChem Bioassay (2009)
BindingDB Entry DOI: 10.7270/Q2RN3686
3C-like protease
(Avian infectious bronchitis virus)
BDBM47546
(2-[[(E)-1-oxo-3-thiophen-2-ylprop-2-enyl]amino]-4-...)
Show SMILES OC(=O)c1c(NC(=O)\C=C\c2cccs2)scc1-c1ccccc1
Show InChI InChI=1S/C18H13NO3S2/c20-15(9-8-13-7-4-10-23-13)19-17-16(18(21)22)14(11-24-17)12-5-2-1-3-6-12/h1-11H,(H,19,20)(H,21,22)/b9-8+
PCBioAssay
n/an/a 5.22E+3n/an/an/an/an/an/a
The Scripps Research Institute Molecular Screening Center
Curated by PubChem BioAssay
Assay Description
Source (MLPCN Center Name): The Scripps Research Institute Molecular Screening Center (SRIMSC) Center Affiliation: The Scripps Research Institute (TS...
PubChem Bioassay (2009)
BindingDB Entry DOI: 10.7270/Q29K48NM
electroneutral potassium-chloride cotransporter KCC2
(Homo sapiens (Human))
BDBM47546
(2-[[(E)-1-oxo-3-thiophen-2-ylprop-2-enyl]amino]-4-...)
Show SMILES OC(=O)c1c(NC(=O)\C=C\c2cccs2)scc1-c1ccccc1
Show InChI InChI=1S/C18H13NO3S2/c20-15(9-8-13-7-4-10-23-13)19-17-16(18(21)22)14(11-24-17)12-5-2-1-3-6-12/h1-11H,(H,19,20)(H,21,22)/b9-8+
Reactome pathway
PCBioAssay
n/an/an/an/a 2.90E+4n/an/an/an/a
Vanderbilt Screening Center for GPCRs, Ion Channels and Transporters
Curated by PubChem BioAssay
Assay Description
Vanderbilt Screening Center for GPCRs, Ion Channels and Transporters Assay Provider: Eric Delpire Assay Provider Affliation: Vanderbilt University Gr...
PubChem Bioassay (2009)
BindingDB Entry DOI: 10.7270/Q2M32T6M
putative hexokinase HKDC1
(Homo sapiens (Human))
BDBM47546
(2-[[(E)-1-oxo-3-thiophen-2-ylprop-2-enyl]amino]-4-...)
Show SMILES OC(=O)c1c(NC(=O)\C=C\c2cccs2)scc1-c1ccccc1
Show InChI InChI=1S/C18H13NO3S2/c20-15(9-8-13-7-4-10-23-13)19-17-16(18(21)22)14(11-24-17)12-5-2-1-3-6-12/h1-11H,(H,19,20)(H,21,22)/b9-8+
PCBioAssay
n/an/a 8.00E+4n/an/an/an/an/an/a
Burnham Center for Chemical Genomics
Curated by PubChem BioAssay
Assay Description
Data Source: Sanford-Burnham Center for Chemical Genomics (SBCCG) Source Affiliation: Sanford-Burnham Medical Research Institute (SBMRI, San Diego, C...
PubChem Bioassay (2011)
BindingDB Entry DOI: 10.7270/Q23F4N3R
SUMO1 activating enzyme subunit 1
(Homo sapiens (Human))
BDBM47546
(2-[[(E)-1-oxo-3-thiophen-2-ylprop-2-enyl]amino]-4-...)
Show SMILES OC(=O)c1c(NC(=O)\C=C\c2cccs2)scc1-c1ccccc1
Show InChI InChI=1S/C18H13NO3S2/c20-15(9-8-13-7-4-10-23-13)19-17-16(18(21)22)14(11-24-17)12-5-2-1-3-6-12/h1-11H,(H,19,20)(H,21,22)/b9-8+
Reactome pathway
PCBioAssay
n/an/a 9.84E+3n/an/an/an/an/an/a
Burnham Center for Chemical Genomics
Curated by PubChem BioAssay
Assay Description
Data Source: Sanford-Burnham Center for Chemical Genomics (SBCCG) Source Affiliation: Sanford-Burnham Medical Research Institute (SBMRI, San Diego, C...
PubChem Bioassay (2010)
BindingDB Entry DOI: 10.7270/Q2BP0175
putative hexokinase HKDC1
(Homo sapiens (Human))
BDBM47546
(2-[[(E)-1-oxo-3-thiophen-2-ylprop-2-enyl]amino]-4-...)
Show SMILES OC(=O)c1c(NC(=O)\C=C\c2cccs2)scc1-c1ccccc1
Show InChI InChI=1S/C18H13NO3S2/c20-15(9-8-13-7-4-10-23-13)19-17-16(18(21)22)14(11-24-17)12-5-2-1-3-6-12/h1-11H,(H,19,20)(H,21,22)/b9-8+
PCBioAssay
n/an/a 7.00E+3n/an/an/an/an/an/a
Burnham Center for Chemical Genomics
Curated by PubChem BioAssay
Assay Description
Data Source: Sanford-Burnham Center for Chemical Genomics (SBCCG) Source Affiliation: Sanford-Burnham Medical Research Institute (SBMRI, San Diego, C...
PubChem Bioassay (2011)
BindingDB Entry DOI: 10.7270/Q2W094D4
ubiquitin-conjugating enzyme E2I
(Homo sapiens (Human))
BDBM47546
(2-[[(E)-1-oxo-3-thiophen-2-ylprop-2-enyl]amino]-4-...)
Show SMILES OC(=O)c1c(NC(=O)\C=C\c2cccs2)scc1-c1ccccc1
Show InChI InChI=1S/C18H13NO3S2/c20-15(9-8-13-7-4-10-23-13)19-17-16(18(21)22)14(11-24-17)12-5-2-1-3-6-12/h1-11H,(H,19,20)(H,21,22)/b9-8+
Reactome pathway
PCBioAssay
n/an/a 2.74E+3n/an/an/an/an/an/a
Burnham Center for Chemical Genomics
Curated by PubChem BioAssay
Assay Description
Data Source: Sanford-Burnham Center for Chemical Genomics (SBCCG) Source Affiliation: Sanford-Burnham Medical Research Institute (SBMRI, San Diego, C...
PubChem Bioassay (2010)
BindingDB Entry DOI: 10.7270/Q2V986G8