BDBM50010928 2-{4-[1-(2,4-Diamino-pteridin-6-ylmethyl)-propyl]-benzoylamino}-4-methylene-pentanedioic acid::CHEMBL308279
SMILES: CCC(Cc1cnc2nc(N)nc(N)c2n1)c1ccc(cc1)C(=O)NC(CC(=C)C(O)=O)C(O)=O
InChI Key: InChIKey=WABHENAZLPSQIE-UHFFFAOYSA-N
Data: 2 IC50
Activity Spreadsheet -- Enzyme Inhibition Constant Data from BindingDB
Found 2 hits for monomerid = 50010928
Trg + Lig
Ki
nM
ΔG°
kcal/mole
IC50
nM
Kd
nM
EC50/IC50
nM
koff
s-1
kon
M-1s-1
pHTemp
°C
Folylpoly-gamma-glutamate synthetase
(Homo sapiens (Human))
BDBM50010928
(2-{4-[1-(2,4-Diamino-pteridin-6-ylmethyl)-propyl]-...)
Show SMILES CCC(Cc1cnc2nc(N)nc(N)c2n1)c1ccc(cc1)C(=O)NC(CC(=C)C(O)=O)C(O)=O
Show InChI InChI=1S/C23H25N7O5/c1-3-12(9-15-10-26-19-17(27-15)18(24)29-23(25)30-19)13-4-6-14(7-5-13)20(31)28-16(22(34)35)8-11(2)21(32)33/h4-7,10,12,16H,2-3,8-9H2,1H3,(H,28,31)(H,32,33)(H,34,35)(H4,24,25,26,29,30)
Reactome pathway
n/an/a 1.18E+5n/an/an/an/an/an/a
University of South Alabama
Curated by ChEMBL
Assay Description
Compound was evaluated for the inhibition of Folyl-polyglutamate synthase in CCRF-CEM Human leukemia cell.
J Med Chem 34: 222-7 (1991)
BindingDB Entry DOI: 10.7270/Q2XD10N1
Dihydrofolate reductase
(Homo sapiens (Human))
BDBM50010928
(2-{4-[1-(2,4-Diamino-pteridin-6-ylmethyl)-propyl]-...)
Show SMILES CCC(Cc1cnc2nc(N)nc(N)c2n1)c1ccc(cc1)C(=O)NC(CC(=C)C(O)=O)C(O)=O
Show InChI InChI=1S/C23H25N7O5/c1-3-12(9-15-10-26-19-17(27-15)18(24)29-23(25)30-19)13-4-6-14(7-5-13)20(31)28-16(22(34)35)8-11(2)21(32)33/h4-7,10,12,16H,2-3,8-9H2,1H3,(H,28,31)(H,32,33)(H,34,35)(H4,24,25,26,29,30)
NCI pathway
Reactome pathway
n/an/a 5.80n/an/an/an/an/an/a
University of South Alabama
Curated by ChEMBL
Assay Description
Compound was tested for its inhibitory activity on Recombinant Human Dihydrofolate Reductase.
J Med Chem 34: 222-7 (1991)
BindingDB Entry DOI: 10.7270/Q2XD10N1