Reaction Details
TargetHistone-lysine N-methyltransferase EZH2 [Y641F]
LigandBDBM172163
Substrate/Competitorn/a
Meas. Tech.PRC2 Enzyme Assays on Peptide Substrates
IC50 0.760±n/a nM
Citation Kuntz, KWChesworth, RDuncan, KWKeilhack, HWarholic, NKlaus, CKnutson, SKWigle, TJSeki, MShirotori, SKawano, S Aryl-or heteroaryl-substituted benzene compounds US Patent US11052093 Publication Date 7/6/2021
 
Histone-lysine N-methyltransferase EZH2 [Y641F]
Name:Histone-lysine N-methyltransferase EZH2 [Y641F]
Type:n/a
Mol. Mass.:85351.84
Organism:Homo sapiens (Human)
Description:Q15910[Y641F]
Residue:746
BDBM172163
NameBDBM172163
Synonyms:US10155002, Compound 171 US9090562, 171
TypeSmall organic molecule
Emp. Form.C33H44N6O3
Mol. Mass.572.7409
SMILESCCN(C1CCOCC1)c1cc(cc(C(=O)NCc2c(C)cc(C)[nH]c2=O)c1C)-c1ccc(nc1)N1CCN(C)CC1