Reaction Details
TargetHistone-lysine N-methyltransferase EZH2
LigandBDBM172176
Substrate/Competitorn/a
Meas. Tech.PRC2 Enzyme Assays on Peptide Substrates
IC50 0.920±n/a nM
Citation Kuntz, KWChesworth, RDuncan, KWKeilhack, HWarholic, NKlaus, CKnutson, SKWigle, TJSeki, MShirotori, SKawano, S Aryl-or heteroaryl-substituted benzene compounds US Patent US11052093 Publication Date 7/6/2021
 
Histone-lysine N-methyltransferase EZH2
Name:Histone-lysine N-methyltransferase EZH2
Type:Protein
Mol. Mass.:85367.84
Organism:Homo sapiens (Human)
Description:Q15910
Residue:746
BDBM172176
NameBDBM172176
Synonyms:EPZ009161 US11052093, Compound 184 US9175331, 61
TypeSmall organic molecule
Emp. Form.C34H46N6O3
Mol. Mass.586.7674
SMILESCCCc1cc(C)[nH]c(=O)c1CNC(=O)c1cc(cc(N(CC)C2CCOCC2)c1C)-c1ccc(nc1)N1CCNCC1