Reaction Details
TargetComplement factor D
LigandBDBM303026
Substrate/Competitorn/a
Meas. Tech.Factor D Assay
IC50<1000±n/a nM
Citation Gadhachanda, VRHashimoto, APais, GWang, QChen, DWang, XAgarwal, ADeshpande, MWiles, JAPhadke, AS Amino compounds for treatment of complement mediated disorders US Patent US9598446 Publication Date 3/21/2017
 
Complement factor D
Name:Complement factor D
Type:Protein
Mol. Mass.:27039.19
Organism:Homo sapiens (Human)
Description:P00746
Residue:253
BDBM303026
NameBDBM303026
Synonyms:(2S,4R)-1-(2-(3- acetyl-5-(pyrimidin-5- ylamino)-1H-indol-1- yl)acetyl)-4-fluoro-N- (pyridin-3- yl)pyrrolidine-2- carboxamide US9598446, Compound 31
TypeSmall organic molecule
Emp. Form.C26H24FN7O3
Mol. Mass.501.5123
SMILESCC(=O)c1cn(CC(=O)N2C[C@H](F)C[C@H]2C(=O)Nc2cccnc2)c2ccc(Nc3cncnc3)cc12