Reaction Details
TargetComplement factor D
LigandBDBM303047
Substrate/Competitorn/a
Meas. Tech.Factor D Assay
IC50 5500±n/a nM
Citation Gadhachanda, VRHashimoto, APais, GWang, QChen, DWang, XAgarwal, ADeshpande, MWiles, JAPhadke, AS Amino compounds for treatment of complement mediated disorders US Patent US9598446 Publication Date 3/21/2017
 
Complement factor D
Name:Complement factor D
Type:Protein
Mol. Mass.:27039.19
Organism:Homo sapiens (Human)
Description:P00746
Residue:253
BDBM303047
NameBDBM303047
Synonyms:(2S,4R)-1-(2-(3- acetyl-5-(pyrimidin-5- ylamino)-1H-indol-1- yl)acetyl)-4-fluoro-N- (6- (trifluoromethyl)benzo [d]isoxazol-3- yl)pyrrolidine-2- carboxamide | US9598446, Compound 52
TypeSmall organic molecule
Emp. Form.C30H24F4N6O4
Mol. Mass.608.543
SMILESCC(=O)c1cn(CC(=O)C2C[C@H](F)C[C@H]2C(=O)Nc2noc3cc(ccc23)C(F)(F)F)c2ccc(Nc3cncnc3)cc12