Reaction Details
TargetHistone-lysine N-methyltransferase EZH2
LigandBDBM172088
Substrate/Competitorn/a
Meas. Tech.PRC2 Enzyme Assays
IC50 2.46±n/a nM
Citation Kuntz, KWChesworth, RDuncan, KWKeilhack, HWarholic, NKlaus, CKnutson, SKWigle, TJSeki, MShirotori, SKawano, S Aryl- or heteroaryl-substituted benzene compounds US Patent US10155002 Publication Date 12/18/2018
 
Histone-lysine N-methyltransferase EZH2
Name:Histone-lysine N-methyltransferase EZH2
Type:Protein
Mol. Mass.:85367.84
Organism:Homo sapiens (Human)
Description:Q15910
Residue:746
BDBM172088
NameBDBM172088
Synonyms:US10155002, Compound 94 US9090562, 94
TypeSmall organic molecule
Emp. Form.C34H46N4O3
Mol. Mass.558.754
SMILESCCN(CC)Cc1ccc(cc1)-c1cc(N(CC)C2CCOCC2)c(C)c(c1)C(=O)NCc1c(C)cc(C)[nH]c1=O