Reaction Details
TargetHistone-lysine N-methyltransferase EZH2 [Y641F]
LigandBDBM172162
Substrate/Competitorn/a
Meas. Tech.PRC2 Enzyme Assays
IC50 1.63±n/a nM
Citation Kuntz, KWChesworth, RDuncan, KWKeilhack, HWarholic, NKlaus, CKnutson, SKWigle, TJSeki, MShirotori, SKawano, S Aryl- or heteroaryl-substituted benzene compounds US Patent US10155002 Publication Date 12/18/2018
 
Histone-lysine N-methyltransferase EZH2 [Y641F]
Name:Histone-lysine N-methyltransferase EZH2 [Y641F]
Type:n/a
Mol. Mass.:85351.84
Organism:Homo sapiens (Human)
Description:Q15910[Y641F]
Residue:746
BDBM172162
NameBDBM172162
Synonyms:US10155002, Compound 170 US9090562, 170
TypeSmall organic molecule
Emp. Form.C36H51N7O2
Mol. Mass.613.8358
SMILESCCN([C@H]1CC[C@@H](CC1)N(C)C)c1cc(cc(C(=O)NCc2c(C)cc(C)[nH]c2=O)c1C)-c1ccc(nc1)N1CCN(C)CC1