Reaction Details
TargetHistone-lysine N-methyltransferase EZH2
LigandBDBM172174
Substrate/Competitorn/a
Meas. Tech.PRC2 Enzyme Assays
IC50 6.66±n/a nM
Citation Kuntz, KWChesworth, RDuncan, KWKeilhack, HWarholic, NKlaus, CKnutson, SKWigle, TJSeki, MShirotori, SKawano, S Aryl- or heteroaryl-substituted benzene compounds US Patent US10155002 Publication Date 12/18/2018
 
Histone-lysine N-methyltransferase EZH2
Name:Histone-lysine N-methyltransferase EZH2
Type:Protein
Mol. Mass.:85367.84
Organism:Homo sapiens (Human)
Description:Q15910
Residue:746
BDBM172174
NameBDBM172174
Synonyms:EPZ008681 US11052093, Compound 182 US9175331, 44
TypeSmall organic molecule
Emp. Form.C36H49N5O4
Mol. Mass.615.8054
SMILESCCN([C@H]1CC[C@@H](CC1)N(C)C)c1cc(cc(C(=O)NCc2c(C)cc(C)[nH]c2=O)c1C)-c1ccc(cc1)C(=O)NCCCO