Reaction Details
TargetHistone-lysine N-methyltransferase EZH2 [Y641F]
LigandBDBM172177
Substrate/Competitorn/a
Meas. Tech.PRC2 Enzyme Assays
IC50 3.74±n/a nM
Citation Kuntz, KWChesworth, RDuncan, KWKeilhack, HWarholic, NKlaus, CKnutson, SKWigle, TJSeki, MShirotori, SKawano, S Aryl- or heteroaryl-substituted benzene compounds US Patent US10155002 Publication Date 12/18/2018
 
Histone-lysine N-methyltransferase EZH2 [Y641F]
Name:Histone-lysine N-methyltransferase EZH2 [Y641F]
Type:n/a
Mol. Mass.:85351.84
Organism:Homo sapiens (Human)
Description:Q15910[Y641F]
Residue:746
BDBM172177
NameBDBM172177
Synonyms:US10155002, Compound 185 US9090562, 185
TypeSmall organic molecule
Emp. Form.C34H46N6O3
Mol. Mass.586.7674
SMILESCCN(C1CCOCC1)c1cc(cc(C(=O)NCc2c(cc(C)[nH]c2=O)C(C)C)c1C)-c1ccc(nc1)N1CCNCC1