Reaction Details
TargetHistone-lysine N-methyltransferase EZH2
LigandBDBM172181
Substrate/Competitorn/a
Meas. Tech.PRC2 Enzyme Assays
IC50 1.64±n/a nM
Citation Kuntz, KWChesworth, RDuncan, KWKeilhack, HWarholic, NKlaus, CKnutson, SKWigle, TJSeki, MShirotori, SKawano, S Aryl- or heteroaryl-substituted benzene compounds US Patent US10155002 Publication Date 12/18/2018
 
Histone-lysine N-methyltransferase EZH2
Name:Histone-lysine N-methyltransferase EZH2
Type:Protein
Mol. Mass.:85367.84
Organism:Homo sapiens (Human)
Description:Q15910
Residue:746
BDBM172181
NameBDBM172181
Synonyms:US10155002, Compound 189 US9090562, 189
TypeSmall organic molecule
Emp. Form.C40H57N7O3
Mol. Mass.683.9257
SMILESCCCc1cc(C)[nH]c(=O)c1CNC(=O)c1cc(cc(N(CC)C2CCOCC2)c1C)-c1ccc(nc1)N1CCN(CC1)C1CCN(C)CC1