Reaction Details
TargetHistone-lysine N-methyltransferase EZH2
LigandBDBM172183
Substrate/Competitorn/a
Meas. Tech.PRC2 Enzyme Assays
IC50 3.84±n/a nM
Citation Kuntz, KWChesworth, RDuncan, KWKeilhack, HWarholic, NKlaus, CKnutson, SKWigle, TJSeki, MShirotori, SKawano, S Aryl- or heteroaryl-substituted benzene compounds US Patent US10155002 Publication Date 12/18/2018
 
Histone-lysine N-methyltransferase EZH2
Name:Histone-lysine N-methyltransferase EZH2
Type:Protein
Mol. Mass.:85367.84
Organism:Homo sapiens (Human)
Description:Q15910
Residue:746
BDBM172183
NameBDBM172183
Synonyms:US10155002, Compound 191 US9090562, 191
TypeSmall organic molecule
Emp. Form.C35H47N5O4
Mol. Mass.601.7788
SMILESCCCc1cc(C)[nH]c(=O)c1CNC(=O)c1cc(cc(N(CC)C2CCOCC2)c1C)-c1ccc(CN2CCOCC2)nc1