Reaction Details
TargetHistone-lysine N-methyltransferase EZH2
LigandBDBM172184
Substrate/Competitorn/a
Meas. Tech.PRC2 Enzyme Assays
IC50 3.22±n/a nM
Citation Kuntz, KWChesworth, RDuncan, KWKeilhack, HWarholic, NKlaus, CKnutson, SKWigle, TJSeki, MShirotori, SKawano, S Aryl- or heteroaryl-substituted benzene compounds US Patent US10155002 Publication Date 12/18/2018
 
Histone-lysine N-methyltransferase EZH2
Name:Histone-lysine N-methyltransferase EZH2
Type:Protein
Mol. Mass.:85367.84
Organism:Homo sapiens (Human)
Description:Q15910
Residue:746
BDBM172184
NameBDBM172184
Synonyms:US10155002, Compound 192 US9090562, 192
TypeSmall organic molecule
Emp. Form.C35H48N6O3
Mol. Mass.600.794
SMILESCCN(C1CCOCC1)c1cc(cc(C(=O)NCc2c(C)cc(C)[nH]c2=O)c1C)-c1ccc(nc1)N1CCC(CC1)N(C)C