Reaction Details
TargetAcetylcholinesterase
LigandBDBM10739
Substrate/CompetitorBDBM10759
Meas. Tech.Cholinesterase Inhibition Assay
pH7.4±n/a
Temperature310.15±n/a K
IC50 460±n/a nM
Citation Sterling, JHerzig, YGoren, TFinkelstein, NLerner, DGoldenberg, WMiskolczi, IMolnar, SRantal, FTamas, TToth, GZagyva, AZekany, AFinberg, JLavian, GGross, AFriedman, RRazin, MHuang, WKrais, BChorev, MYoudim, MBWeinstock, M Novel dual inhibitors of AChE and MAO derived from hydroxy aminoindan and phenethylamine as potential treatment for Alzheimer's disease. J Med Chem45:5260-79 (2002) 
 
Acetylcholinesterase
Name:Acetylcholinesterase
Type:Enzyme
Mol. Mass.:67792.70
Organism:Homo sapiens (Human)
Description:P22303
Residue:614
BDBM10739
BDBM10759
NameBDBM10739
Synonyms:3-amino-2,3-dihydro-1H-inden-4-yl N,N-dimethylcarbamate | Aminoindan deriv. 11a
TypeSmall organic molecule
Emp. Form.C12H16N2O2
Mol. Mass.220.2676
SMILESCN(C)C(=O)Oc1cccc2CCC(N)c12