Reaction Details
TargetAcetylcholinesterase
LigandBDBM10783
Substrate/CompetitorBDBM10759
Meas. Tech.Cholinesterase Inhibition Assay
IC50 53±n/a nM
Citation Sterling, JHerzig, YGoren, TFinkelstein, NLerner, DGoldenberg, WMiskolczi, IMolnar, SRantal, FTamas, TToth, GZagyva, AZekany, AFinberg, JLavian, GGross, AFriedman, RRazin, MHuang, WKrais, BChorev, MYoudim, MBWeinstock, M Novel dual inhibitors of AChE and MAO derived from hydroxy aminoindan and phenethylamine as potential treatment for Alzheimer's disease. J Med Chem45:5260-79 (2002) 
 
Acetylcholinesterase
Name:Acetylcholinesterase
Type:Enzyme
Mol. Mass.:67792.70
Organism:Homo sapiens (Human)
Description:P22303
Residue:614
BDBM10783
BDBM10759
NameBDBM10783
Synonyms:1-(prop-2-yn-1-ylamino)-2,3-dihydro-1H-inden-4-yl N,N-dimethylcarbamate N-propargylaminoindan 23a
TypeSmall organic molecule
Emp. Form.C15H18N2O2
Mol. Mass.258.3156
SMILESCN(C)C(=O)Oc1cccc2C(CCc12)NCC#C