Reaction Details
TargetAmine oxidase [flavin-containing] A
LigandBDBM10806
Substrate/CompetitorBDBM10755
Meas. Tech.Cholinesterase Inhibition Assay
IC50 70±n/a nM
Citation Sterling, JHerzig, YGoren, TFinkelstein, NLerner, DGoldenberg, WMiskolczi, IMolnar, SRantal, FTamas, TToth, GZagyva, AZekany, AFinberg, JLavian, GGross, AFriedman, RRazin, MHuang, WKrais, BChorev, MYoudim, MBWeinstock, M Novel dual inhibitors of AChE and MAO derived from hydroxy aminoindan and phenethylamine as potential treatment for Alzheimer's disease. J Med Chem45:5260-79 (2002) 
 
Amine oxidase [flavin-containing] A
Name:Amine oxidase [flavin-containing] A
Type:Enzyme
Mol. Mass.:59515.21
Organism:Rattus norvegicus (rat)
Description:n/a
Residue:526
BDBM10806
BDBM10755
NameBDBM10806
Synonyms:3-[methyl(prop-2-yn-1-yl)amino]-2,3-dihydro-1H-inden-4-ol | Aminoindan deriv. 40v
TypeSmall organic molecule
Emp. Form.C13H15NO
Mol. Mass.201.2643
SMILESCN(CC#C)C1CCc2cccc(O)c12