Reaction Details
TargetAcetylcholinesterase
LigandBDBM10831
Substrate/CompetitorBDBM10759
Meas. Tech.Cholinesterase Inhibition Assay
IC50 6300±n/a nM
Citation Sterling, JHerzig, YGoren, TFinkelstein, NLerner, DGoldenberg, WMiskolczi, IMolnar, SRantal, FTamas, TToth, GZagyva, AZekany, AFinberg, JLavian, GGross, AFriedman, RRazin, MHuang, WKrais, BChorev, MYoudim, MBWeinstock, M Novel dual inhibitors of AChE and MAO derived from hydroxy aminoindan and phenethylamine as potential treatment for Alzheimer's disease. J Med Chem45:5260-79 (2002) 
 
Acetylcholinesterase
Name:Acetylcholinesterase
Type:Enzyme
Mol. Mass.:67792.70
Organism:Homo sapiens (Human)
Description:P22303
Residue:614
BDBM10831
BDBM10759
NameBDBM10831
Synonyms:3-[(2S)-2-[methyl(prop-2-yn-1-yl)amino]propyl]phenyl N-cyclohexyl-N-methylcarbamate; methanesulfonic acid Phenethylamine deriv. (S)53e.Mesylate
TypeSmall organic molecule
Emp. Form.C21H30N2O2
Mol. Mass.342.4751
SMILESC[C@@H](Cc1cccc(OC(=O)N(C)C2CCCCC2)c1)N(C)CC#C