Reaction Details
TargetAmine oxidase [flavin-containing] A
LigandBDBM10823
Substrate/CompetitorBDBM10755
Meas. Tech.Cholinesterase Inhibition Assay
IC50 120±n/a nM
Citation Sterling, JHerzig, YGoren, TFinkelstein, NLerner, DGoldenberg, WMiskolczi, IMolnar, SRantal, FTamas, TToth, GZagyva, AZekany, AFinberg, JLavian, GGross, AFriedman, RRazin, MHuang, WKrais, BChorev, MYoudim, MBWeinstock, M Novel dual inhibitors of AChE and MAO derived from hydroxy aminoindan and phenethylamine as potential treatment for Alzheimer's disease. J Med Chem45:5260-79 (2002) 
 
Amine oxidase [flavin-containing] A
Name:Amine oxidase [flavin-containing] A
Type:Enzyme
Mol. Mass.:59515.21
Organism:Rattus norvegicus (rat)
Description:n/a
Residue:526
BDBM10823
BDBM10755
NameBDBM10823
Synonyms:3-{2-[methyl(prop-2-yn-1-yl)amino]propyl}phenyl N,N-dimethylcarbamate | Phenethylamine deriv. 53a
TypeSmall organic molecule
Emp. Form.C16H22N2O2
Mol. Mass.274.3581
SMILESCC(Cc1cccc(OC(=O)N(C)C)c1)N(C)CC#C