Reaction Details
TargetAcetylcholinesterase
LigandBDBM10441
Substrate/CompetitorBDBM8959
Meas. Tech.Enzyme Inhibition Assay
pH7.4±n/a
Temperature310.15±n/a K
IC50 72.4±3.8 nM
Citation Feng, SWang, ZHe, XZheng, SXia, YJiang, HTang, XBai, D Bis-huperzine B: highly potent and selective acetylcholinesterase inhibitors. J Med Chem48:655-7 (2005) 
 
Acetylcholinesterase
Name:Acetylcholinesterase
Type:Enzyme
Mol. Mass.:68193.62
Organism:Rattus norvegicus (rat)
Description:P37136
Residue:614
BDBM10441
BDBM8959
NameBDBM10441
Synonyms:(+)-Huperzine A (-)-Huperzine A (1R,13E)-1-amino-13-ethylidene-11-methyl-6-azatricyclo[7.3.1.0^{2,7}]trideca-2(7),3,10-trien-5-one (5S,11E)-5-amino-11-ethylidene-7-methyl-5,6,9,10-tetrahydro-5,9-methanocycloocta[b]pyridin-2(1H)-one | Huperzine A
TypeSmall organic molecule
Emp. Form.C15H18N2O
Mol. Mass.242.3162
SMILESC\C=C1/C2Cc3[nH]c(=O)ccc3C1(N)CC(C)=C2