Reaction Details
TargetMitogen-activated protein kinase 1 [8-360]
LigandBDBM193781
Substrate/Competitorn/a
Meas. Tech.ERK-2 Enzymatic Assay
pH7.3±n/a
IC50 0.80±n/a nM
Commentsextracted
Citation Blake, JFCook, AGaudino, JGunawardana, IWHicken, EJHunt, KWLyon, MMetcalf, ATMohr, PJMoreno, DANewhouse, BRen, LSchwarz, JChen, HGazzard, LSchmidt, JDo, S Serine/threonine kinase inhibitors US Patent US9670208 Publication Date 6/6/2017
 
Mitogen-activated protein kinase 1 [8-360]
Name:Mitogen-activated protein kinase 1 [8-360]
Type:n/a
Mol. Mass.:40835.09
Organism:Homo sapiens (Human)
Description:P28482 aa 8-360
Residue:353
BDBM193781
NameBDBM193781
Synonyms:US9670208, Example 493 4-(3-((6-ethoxypyridin-3-yl)methyl)-[1,2,4]triazolo[4,3-a]pyridin-7-yl)-N-(1-methyl-1H-pyrazol-5-yl)pyrimidin-2-amine
TypeSmall organic molecule
Emp. Form.C22H21N9O
Mol. Mass.427.4618
SMILESCCOc1ccc(Cc2nnc3cc(ccn23)-c2ccnc(Nc3ccnn3C)n2)cn1