Reaction Details
TargetDipeptidyl peptidase 4
LigandBDBM11643
Substrate/CompetitorBDBM11057
Meas. Tech.DPP Inhibition Assay
pH7.5±n/a
Temperature295.15±n/a K
Ki 56±n/a nM
Citation Longenecker, KLStewart, KDMadar, DJJakob, CGFry, EHWilk, SLin, CWBallaron, SJStashko, MALubben, THYong, HPireh, DPei, ZBasha, FWiedeman, PEvon Geldern, TWTrevillyan, JMStoll, VS Crystal structures of DPP-IV (CD26) from rat kidney exhibit flexible accommodation of peptidase-selective inhibitors. Biochemistry45:7474-82 (2006) 
 
Dipeptidyl peptidase 4
Name:Dipeptidyl peptidase 4
Type:Enzyme
Mol. Mass.:88084.94
Organism:Rattus norvegicus (rat)
Description:n/a
Residue:767
BDBM11643
BDBM11057
NameBDBM11643
Synonyms:(2S,5R)-1-((2S)-2-amino-2-cyclopentylethanoyl)-5-prop-1-ynylpyrrolidine-2-carbonitrile C5-substituted pyrrolidine 19 | alkynyl cyanopyrrolidine 2
TypeSmall organic molecule
Emp. Form.C15H21N3O
Mol. Mass.259.3467
SMILESCC#C[C@H]1CC[C@@H](C#N)N1C(=O)[C@@H](N)C1CCCC1