Reaction Details
TargetDipeptidyl peptidase 8
LigandBDBM11645
Substrate/CompetitorBDBM11057
Meas. Tech.DPP Inhibition Assay
pH7.5±n/a
Temperature295.15±n/a K
Ki>30000±n/a nM
Citation Longenecker, KLStewart, KDMadar, DJJakob, CGFry, EHWilk, SLin, CWBallaron, SJStashko, MALubben, THYong, HPireh, DPei, ZBasha, FWiedeman, PEvon Geldern, TWTrevillyan, JMStoll, VS Crystal structures of DPP-IV (CD26) from rat kidney exhibit flexible accommodation of peptidase-selective inhibitors. Biochemistry45:7474-82 (2006) 
 
Dipeptidyl peptidase 8
Name:Dipeptidyl peptidase 8
Type:Enzyme
Mol. Mass.:103342.62
Organism:Homo sapiens (Human)
Description:Q6V1X1
Residue:898
BDBM11645
BDBM11057
NameBDBM11645
Synonyms:2-{[8-(3-aminopiperidin-1-yl)-1,3-dimethyl-2,6-dioxo-2,3,6,7-tetrahydro-1H-purin-7-yl]methyl}benzonitrile Xanthine mimetic compound 6
TypeSmall organic molecule
Emp. Form.C20H23N7O2
Mol. Mass.393.4423
SMILESCn1c2nc(N3CCCC(N)C3)n(Cc3ccccc3C#N)c2c(=O)n(C)c1=O