Reaction Details
TargetE3 ubiquitin-protein ligase SMURF1
LigandBDBM239095
Substrate/Competitorn/a
Meas. Tech.Pharmaceutical Assay
IC50 3.20±n/a nM
Citation Bala, KJBrearley, ADale, JEdwards, AAhmed, MPorter, DPulz, RARooney, LASandham, DAShaw, DSmith, NTaylor, JLTaylor, RJTroxler, TJWrigglesworth, J Carboxamide derivatives US Patent US10195181 Publication Date 2/5/2019
 
E3 ubiquitin-protein ligase SMURF1
Name:E3 ubiquitin-protein ligase SMURF1
Type:PROTEIN
Mol. Mass.:86120.64
Organism:Homo sapiens (Human)
Description:ChEMBL_116984
Residue:757
BDBM239095
NameBDBM239095
Synonyms:US10195181, Example 1.4 | US9403810, 1.4
TypeSmall organic molecule
Emp. Form.C26H38N4O3
Mol. Mass.454.6049
SMILESCc1c(noc1C1=CCC(CC1)C(C)(C)C)C(=O)Nc1c(C)n(C)n(C2CCCCC2)c1=O