Reaction Details
TargetE3 ubiquitin-protein ligase SMURF1
LigandBDBM239107
Substrate/Competitorn/a
Meas. Tech.Pharmaceutical Assay
IC50 19.0±n/a nM
Citation Bala, KJBrearley, ADale, JEdwards, AAhmed, MPorter, DPulz, RARooney, LASandham, DAShaw, DSmith, NTaylor, JLTaylor, RJTroxler, TJWrigglesworth, J Carboxamide derivatives US Patent US10195181 Publication Date 2/5/2019
 
E3 ubiquitin-protein ligase SMURF1
Name:E3 ubiquitin-protein ligase SMURF1
Type:PROTEIN
Mol. Mass.:86120.64
Organism:Homo sapiens (Human)
Description:ChEMBL_116984
Residue:757
BDBM239107
NameBDBM239107
Synonyms:US10195181, Example 7 | US9403810, 7
TypeSmall organic molecule
Emp. Form.C22H34N4O3
Mol. Mass.402.5304
SMILESCc1c(CCC(C)(C)C)onc1C(=O)Nc1c(C)n(C)n(C2CCCCC2)c1=O