Reaction Details
TargetE3 ubiquitin-protein ligase SMURF1
LigandBDBM239115
Substrate/Competitorn/a
Meas. Tech.Pharmaceutical Assay
IC50 180±n/a nM
Citation Bala, KJBrearley, ADale, JEdwards, AAhmed, MPorter, DPulz, RARooney, LASandham, DAShaw, DSmith, NTaylor, JLTaylor, RJTroxler, TJWrigglesworth, J Carboxamide derivatives US Patent US10195181 Publication Date 2/5/2019
 
E3 ubiquitin-protein ligase SMURF1
Name:E3 ubiquitin-protein ligase SMURF1
Type:PROTEIN
Mol. Mass.:86120.64
Organism:Homo sapiens (Human)
Description:ChEMBL_116984
Residue:757
BDBM239115
NameBDBM239115
Synonyms:US10195181, Example 20 | US9403810, 20
TypeSmall organic molecule
Emp. Form.C23H34N4O5
Mol. Mass.446.5399
SMILESC[C@@H]1OC(C)(C)CO[C@H]1c1onc(C(=O)Nc2c(C)n(C)n(C3CCCCC3)c2=O)c1C