Reaction Details
TargetE3 ubiquitin-protein ligase SMURF1
LigandBDBM239135
Substrate/Competitorn/a
Meas. Tech.Pharmaceutical Assay
IC50 340±n/a nM
Citation Bala, KJBrearley, ADale, JEdwards, AAhmed, MPorter, DPulz, RARooney, LASandham, DAShaw, DSmith, NTaylor, JLTaylor, RJTroxler, TJWrigglesworth, J Carboxamide derivatives US Patent US10195181 Publication Date 2/5/2019
 
E3 ubiquitin-protein ligase SMURF1
Name:E3 ubiquitin-protein ligase SMURF1
Type:PROTEIN
Mol. Mass.:86120.64
Organism:Homo sapiens (Human)
Description:ChEMBL_116984
Residue:757
BDBM239135
NameBDBM239135
Synonyms:US10195181, Example 24b | US9403810, 24a
TypeSmall organic molecule
Emp. Form.C23H34N4O4
Mol. Mass.430.5405
SMILESCC(C)[C@@H]1CO[C@H](C1)c1onc(C(=O)Nc2c(C)n(C)n(C3CCCCC3)c2=O)c1C