Reaction Details
TargetE3 ubiquitin-protein ligase SMURF1
LigandBDBM332005
Substrate/Competitorn/a
Meas. Tech.Pharmaceutical Assay
IC50 160±n/a nM
Citation Bala, KJBrearley, ADale, JEdwards, AAhmed, MPorter, DPulz, RARooney, LASandham, DAShaw, DSmith, NTaylor, JLTaylor, RJTroxler, TJWrigglesworth, J Carboxamide derivatives US Patent US10195181 Publication Date 2/5/2019
 
E3 ubiquitin-protein ligase SMURF1
Name:E3 ubiquitin-protein ligase SMURF1
Type:PROTEIN
Mol. Mass.:86120.64
Organism:Homo sapiens (Human)
Description:ChEMBL_116984
Residue:757
BDBM332005
NameBDBM332005
Synonyms:US10195181, Example 25a US10195181, Example 25c | US10195181, Example 25d
TypeSmall organic molecule
Emp. Form.C23H34N4O5
Mol. Mass.446.5399
SMILESCc1c(onc1C(=O)Nc1c(C)n(C)n(C2CCCCC2)c1=O)C1OCC(O1)C(C)(C)C