Reaction Details
TargetCoagulation factor X
LigandBDBM12687
Substrate/CompetitorBDBM12658
Meas. Tech.Enzyme Assay and Determination of the Inhibition Constants.
pH7±n/a
Temperature295.15±n/a K
Ki 0.25±n/a nM
Citation Pinto, DJOrwat, MJQuan, MLHan, QGalemmo, RAAmparo, EWells, BEllis, CHe, MYAlexander, RSRossi, KASmallwood, AWong, PCLuettgen, JMRendina, ARKnabb, RMMersinger, LKettner, CBai, SHe, KWexler, RRLam, PY 1-[3-Aminobenzisoxazol-5'-yl]-3-trifluoromethyl-6-[2'-(3-(R)-hydroxy-N-pyrrolidinyl)methyl-[1,1']-biphen-4-yl]-1,4,5,6-tetrahydropyrazolo-[3,4-c]-pyridin-7-one (BMS-740808) a highly potent, selective, efficacious, and orally bioavailable inhibitor of blood coagulation factor Xa. Bioorg Med Chem Lett16:4141-7 (2006) 
 
Coagulation factor X
Name:Coagulation factor X
Type:Enzyme
Mol. Mass.:54726.60
Organism:Homo sapiens (Human)
Description:n/a
Residue:488
BDBM12687
BDBM12658
NameBDBM12687
Synonyms:1-(3-amino-1,2-benzoxazol-5-yl)-6-(4-{2-[(dimethylamino)methyl]phenyl}phenyl)-3-(trifluoromethyl)-1H,4H,5H,6H,7H-pyrazolo[4,3-d]pyrimidin-7-one dihydropyrazolo[4,3-d]pyrimidinone 24a
TypeSmall organic molecule
Emp. Form.C28H24F3N7O2
Mol. Mass.547.5311
SMILESCN(C)Cc1ccccc1-c1ccc(cc1)N1CNc2c(nn(c2C1=O)-c1ccc2onc(N)c2c1)C(F)(F)F