Reaction Details
TargetUrokinase-type plasminogen activator
LigandBDBM14152
Substrate/CompetitorBDBM13949
Meas. Tech.Enzyme Assay and Determination of the Inhibition Constants
pH7.4±n/a
Temperature295.15±n/a K
Ki 9±n/a nM
Citation Katz, BASprengeler, PALuong, CVerner, EElrod, KKirtley, MJanc, JSpencer, JRBreitenbucher, JGHui, HMcGee, DAllen, DMartelli, AMackman, RL Engineering inhibitors highly selective for the S1 sites of Ser190 trypsin-like serine protease drug targets. Chem Biol8:1107-21 (2001) 
 
Urokinase-type plasminogen activator
Name:Urokinase-type plasminogen activator
Type:Enzyme
Mol. Mass.:48528.62
Organism:Homo sapiens (Human)
Description:P00749
Residue:431
BDBM14152
BDBM13949
NameBDBM14152
Synonyms:6-CHLORO-2-(2-HYDROXY-BIPHENYL-3-YL)-1H-INDOLE-5-CARBOXAMIDINE CA-14 {amino[6-chloro-2-(2-hydroxy-3-phenylphenyl)-1H-indol-5-yl]methylidene}azanium
TypeSmall organic molecule
Emp. Form.C21H17ClN3O
Mol. Mass.362.832
SMILESNC(=[NH2+])c1cc2cc([nH]c2cc1Cl)-c1cccc(-c2ccccc2)c1O