Reaction Details
TargetKallikrein-1
LigandBDBM345061
Substrate/Competitorn/a
Meas. Tech.Kallikrein Assay
IC50 1.90±n/a nM
Citation Liu, WEdmondson, SDGuo, ZMertz, EOgawa, AKSo, SSun, WBrockunier, LLAli, AKuang, RWu, H Factor Xla inhibitors US Patent US9783530 Publication Date 10/10/2017
 
Kallikrein-1
Name:Kallikrein-1
Type:Enzyme
Mol. Mass.:28874.69
Organism:Homo sapiens (Human)
Description:P06870
Residue:262
BDBM345061
NameBDBM345061
Synonyms:2-{5-[5-chloro-2-(1H- tetrazol-1-yl)phenyl]-1- oxidopyridin-2-yl}-N- 1H-indazol-6-yl-3- phenylpropanamide | US9783530, 6
TypeSmall organic molecule
Emp. Form.C28H22ClN8O
Mol. Mass.521.98
SMILESClc1ccc(c(c1)-c1ccc([nH+]c1)C(Cc1ccccc1)C(=O)Nc1ccc2cn[nH]c2c1)-n1cnnn1